{"text_format":"1","workbook":"xlsx","n_sheets":11,"sheets":["Input Data","Verif Checklist PCR ed3","Verif Checklist PCR ed4","Indicators","Conformity declaration EN","Conformity declaration FR","Verif Report EN","Verif Report FR","Listes","Table EN","Table FR"],"not_rendered":{"charts":3,"images":1,"macros":1,"external_links":3,"defined_names":21,"comments":0,"pivot_tables":0},"unopened":[],"bounds":{"document_bytes":16777216,"sheet_cells":100000,"rows_first":2000,"rows_last":500,"rows_between":2000,"halvings":0,"cell_chars":16384,"cell_head_chars":4096},"cells_cut":0,"cells_raw":0,"read":"whole","date_system":"1900"}

{"sheet":"Input Data","index":0,"n_rows":30,"n_cols":18,"rows_kept":30,"cut":false,"hidden":false,"merged":[[10,3,11,3],[18,3,20,3],[24,1,26,1],[27,1,27,2],[28,1,28,2],[21,1,23,1],[18,1,20,1],[12,1,12,2],[13,1,13,2],[21,3,23,3],[24,3,26,3],[14,3,17,3],[14,1,17,1],[10,1,11,1],[3,1,4,5],[5,1,5,2],[6,1,6,2],[7,1,7,2],[8,1,9,1],[8,3,9,3]]}
[]
[]
[null,null,null,null,null,"Title 1"]
[null,"Data to be filled for the verification report and declaration of conformity",null,null,null,null,null,"PEP covered by report"]
[null,null,null,null,null,null,null,"Title","Title 1","Title 2","Title 3","Title 4","Title 5","Title 6","Title 7","Title 8","Title 9","Title 10"]
[null,"PEP Ecopassport N°",null,{"$f":"B6","v":"PEP Ecopassport N°"},null,{"$f":"INDEX($I$6:$AL$9,3,MATCH($F$3,$I$5:$AL$5,0))","v":"XXXX-YYYYY-V01.01-FR"},null,"PEP number","XXXX-YYYYY","XXXX-YYYYY","XXXX-YYYYY","XXXX-YYYYY","XXXX-YYYYY","XXXX-YYYYY","XXXX-YYYYY","XXXX-YYYYY","XXXX-YYYYY","XXXX-YYYYY"]
[null,"PEP Title",null,"Titre du PEP",null,{"$f":"F3","v":"Title 1"},null,"Version","-V01.01-FR",{"$f":"$I$7","v":"-V01.01-FR"},{"$f":"$I$7","v":"-V01.01-FR"},"-V01.01-FR","-V01.01-FR","-V01.01-FR","-V01.01-FR","-V01.01-FR","-V01.01-FR","-V01.01-FR"]
[null,"PEP Author (first name, name)",null,"Auteur du PEP","Nom, Prénom",null,null,"Registration Number",{"$f":"I6&I7","v":"XXXX-YYYYY-V01.01-FR"}]
[null,"Released by ","Organization name","Réalisé par","Nom de l'organisation",null,null,"Identification",{"$f":"I6&I7&\" (\"&I5&\")\"","v":"XXXX-YYYYY-V01.01-FR (Title 1)"},{"$f":"J6&J7&\" (\"&J5&\")\"","v":"XXXX-YYYYY-V01.01-FR (Title 2)"},"XXXX-YYYYY-V01.01-FR (Title 3)","XXXX-YYYYY-V01.01-FR (Title 4)","XXXX-YYYYY-V01.01-FR (Title 5)","XXXX-YYYYY-V01.01-FR (Title 6)","XXXX-YYYYY-V01.01-FR (Title 7)","XXXX-YYYYY-V01.01-FR (Title 8)","XXXX-YYYYY-V01.01-FR (Title 9)","XXXX-YYYYY-V01.01-FR (Title 10)"]
[null,null,"Adress",null,"Adresse"]
[null,"On behalf of","Organization name","Pour le compte de","Nom de l'organisation"]
[null,null,"Adress",null,"Adresse"]
[null,"Edition date",null,"Date de la publication"]
[null,"Reference of the LCA report ",null,"Référence du rapport ACV"]
[null,"Conformity Framework","PCR reference","Référentiel de conformité","Référence du PCR","PCR-ed4-EN-2021 09 06"]
[null,null,"PSR Reference",null,"Référence du PSR","No specific rules"]
[null,null,"Product category",null,"Catégorie de produits"]
[null,null,"XP-C-08-100",null,"XP-C-08-100","XP C08-100-1:2016"]
[null,"Verifier","First name, name","Vérificateur","Nom, Prénom"]
[null,null,"Organization",null,"Organisation"]
{"$rows_left_out":11}
{"sheet":"Verif Checklist PCR ed3","index":1,"n_rows":163,"n_cols":16,"rows_kept":163,"cut":false,"hidden":false,"merged":[[0,0,0,6],[0,8,3,11],[0,12,3,15],[1,0,3,2],[1,3,1,6],[2,3,2,6],[3,3,3,6],[4,4,4,5],[5,3,7,3],[8,0,9,0],[8,1,9,1],[8,2,9,3],[8,4,9,4],[8,5,9,5],[8,15,9,15],[10,0,32,0],[10,1,16,1],[11,4,16,4],[17,1,29,1],[23,4,25,4],[8,9,9,9],[8,10,9,10],[8,11,9,11],[8,12,9,12],[8,13,9,13],[8,14,9,14],[8,6,9,6],[8,8,9,8],[98,4,101,4],[120,0,126,0],[120,1,126,1],[124,4,126,4],[33,0,33,4],[34,0,78,0],[34,1,78,1],[35,4,42,4],[43,4,44,4],[46,4,50,4],[52,4,57,4],[58,10,58,11],[149,0,159,0],[149,1,159,1],[150,4,159,4],[127,0,127,4],[128,0,137,0],[128,1,137,1],[129,4,130,4],[132,4,133,4],[138,0,148,0],[138,1,148,1],[139,4,148,4],[79,0,79,4],[80,0,119,0],[80,1,119,1],[89,4,96,4]]}
[null,null,null,null,null,null,null,null,"Initial Review",null,null,null,"Final Review"]
["Verification done for on",null,null,{"$f":"'Input Data'!F6","v":"XXXX-YYYYY-V01.01-FR"}]
[null,null,null,{"$f":"'Input Data'!F7","v":"Title 1"}]
[null,null,null,"Reference Product and References covered, if applicable"]
[null,"Verification Summary",null,{"$f":"'[1]Input Data'!F29","v":"Non Favourable opinion"},"Lexique"]
[null,null,null,{"$f":"IF('[1]Input Data'!F28=0,\"\",'[1]Input Data'!F28)","v":""},{"$f":"[1]Listes!B61","v":"C"},{"$f":"[1]Listes!C61","v":"Conform"},{"$f":"F161","v":0}]
[null,null,null,null,{"$f":"[1]Listes!B62","v":"NC"},{"$f":"[1]Listes!C62","v":"Non Conform"},{"$f":"F162","v":0}]
[null,null,null,null,{"$f":"[1]Listes!B63","v":"Info Need"},{"$f":"[1]Listes!C63","v":"Additional information needed"},{"$f":"F163","v":0}]
["Document","Step of the LCA","Verification to do :",null,"PCR section","Approved ","Not Applicable",null,"Type of Comment","Paragraph/Section/page","Comment of the Accredited Verifier","Answer of the organization","Type of Comment","Paragraph/Section/page","Comment of the Accredited Verifier","Answer of the organization"]
[]
["LCA Report","General Information",1,"Conformity of the redaction of the LCA report"]
[null,null,"1.1"," -  Date of the LCA report","§ 3.2"]
[null,null,"1.2"," -  Period of validity"]
[null,null,"1.3"," -  Author of the LCA report"]
[null,null,"1.4"," -  Report identification"]
[null,null,"1.5"," -  PCR version "]
[null,null,"1.5"," -  if applicable, PSR version"]
[null,"Scope of the study",2,"Characterization of the Functional Unit done according to the PCR, including"]
[null,null,"2.1"," - the identification of the product function (service delivered to the user)  in adequacy with the applied PSR or justification if no PSR is applicable","§ 2.1"]
[null,null,"2.2"," - the quantification of the performance or requirement level achieved"]
{"$rows_left_out":144}
{"sheet":"Verif Checklist PCR ed4","index":2,"n_rows":187,"n_cols":17,"rows_kept":187,"cut":false,"hidden":false,"merged":[[8,0,9,0],[8,1,9,1],[8,2,9,3],[8,4,9,4],[8,5,9,5],[0,0,0,6],[0,8,3,10],[0,12,3,16],[4,4,4,5],[5,3,7,3],[4,12,4,13],[1,0,3,2],[1,3,1,6],[2,3,2,6],[3,3,3,6],[8,13,9,13],[8,16,9,16],[8,6,9,6],[8,8,9,8],[8,9,9,9],[8,12,9,12],[8,14,9,14],[8,11,9,11],[10,0,34,0],[10,1,17,1],[11,4,17,4],[18,1,31,1],[25,4,27,4],[115,4,118,4],[143,0,150,0],[143,1,150,1],[147,4,150,4],[35,0,35,4],[36,0,85,0],[36,1,85,1],[37,4,46,4],[47,4,49,4],[51,4,55,4],[57,4,63,4],[64,15,64,16],[172,0,183,0],[172,1,183,1],[173,4,183,4],[151,0,151,4],[152,0,161,0],[152,1,161,1],[153,4,154,4],[156,4,157,4],[162,0,171,0],[162,1,171,1],[163,4,171,4],[86,0,86,4],[87,0,142,0],[87,1,142,1],[106,4,113,4]]}
[null,null,null,null,null,null,null,null,"Initial Review",null,null,null,"Final Review"]
["Verification done for on",null,null,{"$f":"'Input Data'!F6","v":"XXXX-YYYYY-V01.01-FR"}]
[null,null,null,{"$f":"'Input Data'!F14","v":0}]
[null,null,null,"Reference Product and References covered, if applicable"]
[null,"Verification Summary",null,{"$f":"'Input Data'!F29","v":"Non Favourable opinion"},"Lexique",null,null,null,null,null,null,null,"Lexique"]
[null,null,null,{"$f":"IF('Input Data'!F28=0,\"\",'Input Data'!F28)","v":""},{"$f":"Listes!$B$68","v":"C"},{"$f":"Listes!$C$68","v":"Conform"},{"$f":"F185","v":0},null,null,null,null,null,{"$f":"Listes!$B$68","v":"C"},{"$f":"Listes!$C$68","v":"Conform"},{"$f":"O185","v":0}]
[null,null,null,null,{"$f":"Listes!$B$69","v":"NC"},{"$f":"Listes!$C$69","v":"Non Conform"},{"$f":"F186","v":0},null,null,null,null,null,{"$f":"Listes!$B$69","v":"NC"},{"$f":"Listes!$C$69","v":"Non Conform"},{"$f":"O186","v":0}]
[null,null,null,null,{"$f":"Listes!$B$70","v":"Info Need"},{"$f":"Listes!$C$70","v":"Additional information needed"},0,null,null,null,null,null,{"$f":"Listes!$B$70","v":"Info Need"},{"$f":"Listes!$C$70","v":"Additional information needed"},{"$f":"O187","v":0}]
["Document","Step of the LCA","Verification to do :",null,"PCR section","Approved ","Not Applicable",null,"Type of Comment","Paragraph / Section / page","Comment of the Accredited Verifier","Answer of the organization","Initial","Final","Result","Comment of the Accredited Verifier","Answer of the organization"]
[null,null,null,null,null,null,null,null,null,null,{"$f":"'Input Data'!$F$7","v":"Title 1"},null,null,null,null,{"$f":"'Input Data'!$F$7","v":"Title 1"}]
["LCA Report","General Information",1,"Conformity of the redaction of the LCA report"]
[null,null,"1.1"," -  Date of the LCA report","§ 3.2",null,null,null,null,null,null,null,{"$f":"IF(G12<>\"\", G12, F12)","v":0},null,{"$f":"IF(N12<>\"\", N12, M12)","v":0}]
[null,null,"1.2"," -  Period of validity",null,null,null,null,null,null,null,null,{"$f":"IF(G13<>\"\", G13, F13)","v":0},null,{"$f":"IF(N13<>\"\", N13, M13)","v":0}]
[null,null,"1.3"," -  Author of the LCA report",null,null,null,null,null,null,null,null,0,null,0]
[null,null,"1.4"," -  Report identification (product name, PEP number)",null,null,null,null,null,null,null,null,0,null,0]
[null,null,"1.5"," -  PCR version ",null,null,null,null,null,null,null,null,0,null,0]
[null,null,"1.5"," -  if applicable, PSR version",null,null,null,null,null,null,null,null,0,null,0]
[null,null,"1.6"," -  Objective of the study",null,null,null,null,null,null,null,null,0,null,0]
[null,"Scope of the study",2,"Characterization of the Functional Unit done according to the PCR, including",null,null,null,null,null,null,null,null,0,null,0]
[null,null,"2.1"," - the identification of the product function (service delivered to the user)  in adequacy with the applied PSR or justification if no PSR is applicable","§ 2.1",null,null,null,null,null,null,null,0,null,0]
{"$rows_left_out":168}
{"sheet":"Indicators","index":3,"n_rows":38,"n_cols":7,"rows_kept":38,"cut":false,"hidden":false,"merged":[]}
["PCR ed4","Unit","Method",null,"Annexe C","Unit","Method"]
["Climate change - total","kg CO2 eq",null,null,"Global Warming","kg CO2 eq"]
["Climate change - fossil","kg CO2 eq",null,null,"Acidification for soil and water","kg SO2 eq"]
["Climate change - biogenic","kg CO2 eq",null,null,"Eutrophication","kg PO4--- eq"]
["Climate change - land use and change","kg CO2 eq",null,null,"Photochemical ozone creation","kg C2H4 eq"]
["Ozone depletion","kg CFC11 eq",null,null,"Ozone depletion","kg CFC11 eq"]
["Acidification","mol H+ eq"]
["Eutrophication, freshwater","kg P eq"]
["Eutrophication, marine","kg N eq"]
["Eutrophication, terrestrial","mol N eq"]
["Photochemical ozone formation","kg NMVOC eq"]
["Resource use, minerals and metals","kg Sb eq"]
["Resource use, fossils","MJ"]
["Water use","m3 depriv."]
["Particulate matter","disease inc."]
["Ionising radiation","kBq U-235 eq"]
["Ecotoxicity, freshwater","CTUe"]
["Human toxicity, cancer","CTUh"]
["Human toxicity, non-cancer","CTUh"]
["Land use","Pt"]
{"$rows_left_out":19}
{"sheet":"Conformity declaration EN","index":4,"n_rows":40,"n_cols":9,"rows_kept":40,"cut":false,"hidden":false,"merged":[[8,0,8,8],[9,0,9,8],[33,1,33,6],[29,1,29,6],[26,1,26,7],[27,1,27,6],[30,1,30,6]]}
[]
[null,null,null,null,null,null,null,null,"RE0002-ed5-EN"]
[null,null,null,null,null,null,null,null,"Created by L Domingo"]
[null,null,null,null,null,null,null,null,"Approved by E BRIERE"]
[null,null,null,null,null,null,null,null,"Creation : 24 november 2010"]
[null,null,null,null,null,null,null,null,"Last modification : 2022 07 05 "]
[]
[]
["CONFORMITY DECLARATION"]
["PEP ecopassport®"]
[]
[]
[]
[null,"According to the verification of the Product Environmental Profile"]
[]
[null,{"$f":"\"With the title : \"&'Input Data'!F7&\"\"","v":"With the title : Title 1"}]
[null,{"$f":"\"PEP ecopassport number : \"&'Input Data'!F6&\"\"","v":"PEP ecopassport number : XXXX-YYYYY-V01.01-FR"}]
[null,"Released by",{"$f":"'Input Data'!F9","v":0}]
[null,null,{"$f":"'Input Data'!F10","v":0}]
[null,"On behalf of ",{"$f":"'Input Data'!F11","v":0}]
{"$rows_left_out":21}
{"sheet":"Conformity declaration FR","index":5,"n_rows":40,"n_cols":9,"rows_kept":40,"cut":false,"hidden":false,"merged":[[8,0,8,8],[9,0,9,8],[30,1,30,6],[33,1,33,6],[26,1,26,7],[27,1,27,6],[29,1,29,7]]}
[]
[null,null,null,null,null,null,null,null,"RE0002-ed5-FR"]
[null,null,null,null,null,null,null,null,"Créée par E. Brière"]
[null,null,null,null,null,null,null,null,"Approuvé par E BRIERE"]
[null,null,null,null,null,null,null,null,"Date de création : 24 november 2010"]
[null,null,null,null,null,null,null,null,"Dernière modification : 2022 07 05"]
[]
[]
["DECLARATION DE CONFORMITE"]
["PEP ecopassport®"]
[]
[]
[]
[null,"Dans le cadre de la vérification du Profil Environnemental Produit"]
[]
[null,{"$f":"\"Portant le titre : \"&'Input Data'!F7&\"\"","v":"Portant le titre : Title 1"}]
[null,{"$f":"\"PEP ecopassport n° : \"&'Input Data'!F6&\"\"","v":"PEP ecopassport n° : XXXX-YYYYY-V01.01-FR"}]
[null,"Diffusé par : ",{"$f":"'Input Data'!F9","v":0}]
[null,null,{"$f":"'Input Data'!F10","v":0}]
[null,"Pour le compte de",{"$f":"'Input Data'!F11","v":0}]
{"$rows_left_out":21}
{"sheet":"Verif Report EN","index":6,"n_rows":44,"n_cols":9,"rows_kept":44,"cut":false,"hidden":false,"merged":[[41,1,41,8],[8,0,8,8],[9,0,9,8],[20,1,20,8],[23,1,23,3],[24,1,24,3]]}
[]
[null,null,null,null,null,null,null,null,"RE0001-ed4-EN"]
[null,null,null,null,null,null,null,null,"Created by L Domingo"]
[null,null,null,null,null,null,null,null,"Approved by S Hassayoune"]
[null,null,null,null,null,null,null,null,"Creation : 24 november 2010"]
[null,null,null,null,null,null,null,null,"Last modification : July 10, 2019"]
[]
[]
["VERIFICATION REPORT"]
["PEP ecopassport®"]
[]
["Identification of PEP ecopassport® :"]
[null,"- PEP ecopassport® n° :",{"$f":"'Input Data'!F6","v":"XXXX-YYYYY-V01.01-FR"}]
[null,{"$f":"\"- Title : \"&'Input Data'!F7&\"\"","v":"- Title : Title 1"}]
[null,{"$f":"\"- Author : \"&'Input Data'!F8&\"\"","v":"- Author : "}]
[null,"- Released by :  ",{"$f":"'Input Data'!F9","v":0}]
[null,"                        ",{"$f":"'Input Data'!F10","v":0}]
[null,"- On behalf of :",{"$f":"'Input Data'!F11","v":0}]
[null,null,{"$f":"'Input Data'!F12","v":0}]
[null,{"$f":"\"- Edition date : \"","v":"- Edition date : "},{"$f":"'Input Data'!F13","v":0}]
{"$rows_left_out":25}
{"sheet":"Verif Report FR","index":7,"n_rows":44,"n_cols":10,"rows_kept":44,"cut":false,"hidden":false,"merged":[[8,0,8,9],[9,0,9,9],[40,2,41,9],[22,2,22,5],[23,2,23,5]]}
[]
[null,null,null,null,null,null,null,null,null,"RE0001-ed4-EN"]
[null,null,null,null,null,null,null,null,null,"Created by L Domingo"]
[null,null,null,null,null,null,null,null,null,"Approved by S Hassayoune"]
[null,null,null,null,null,null,null,null,null,"Creation : 24 november 2010"]
[null,null,null,null,null,null,null,null,null,"Last modification : July 10, 2019"]
[]
[]
["RAPPORT DE VERIFICATION"]
["PEP ecopassport®"]
[]
[]
["Identification du PEP ecopassport® :"]
[null,null,"- PEP ecopassport® n° :",null,{"$f":"'Input Data'!F6","v":"XXXX-YYYYY-V01.01-FR"}]
[null,null,"- Titre :",null,{"$f":"'Input Data'!F7","v":"Title 1"}]
[null,null,"- Auteur : ",null,{"$f":"'Input Data'!F8","v":0}]
[null,null,"- Diffusé par :   ",null,{"$f":"'Input Data'!F9","v":0}]
[null,null,null,null,{"$f":"'Input Data'!F10","v":0}]
[null,null,"- Date d'édition :",null,{"$f":"'Input Data'!F13","v":0}]
[null,null,"- Rapport d'accompagnement du PEP :",null,null,{"$f":"'Input Data'!F14","v":0}]
{"$rows_left_out":25}
{"sheet":"Listes","index":8,"n_rows":75,"n_cols":3,"rows_kept":75,"cut":false,"hidden":true,"merged":[]}
[]
[null,"Approbation"]
[null,"yes"]
[null,"no"]
[]
[]
[null,"Type of Review"]
[null,"Internal"]
[null,"External"]
[]
[]
[]
[null,"Time of review"]
[null,"during the LCA"]
[null,"at the end of the LCA"]
[]
[]
[]
[null,"Final opinion"]
[null,"Favourable opinion","Avis Favorable"]
{"$rows_left_out":56}
{"sheet":"Table EN","index":9,"n_rows":95,"n_cols":9,"rows_kept":95,"cut":false,"hidden":true,"merged":[[89,0,92,0],[89,1,92,1],[89,5,92,5],[89,6,92,6],[89,7,92,7],[89,8,92,8],[91,3,92,3],[72,8,80,8],[74,3,75,3],[76,3,77,3],[81,0,88,0],[81,1,88,1],[81,4,88,4],[72,0,80,0],[72,1,80,1],[72,4,80,4],[72,5,80,5],[72,6,80,6],[72,7,80,7],[59,8,60,8],[61,0,71,0],[61,1,71,1],[61,2,62,2],[61,5,64,5],[61,6,64,6],[61,7,64,7],[61,8,64,8],[66,3,67,3],[54,1,60,1],[54,4,57,4],[54,5,58,5],[54,6,58,6],[54,7,58,7],[54,8,58,8],[59,4,60,4],[59,5,60,5],[59,6,60,6],[59,7,60,7],[23,0,60,0],[47,8,48,8],[50,1,53,1],[50,3,53,3],[50,4,53,4],[50,5,53,5],[50,6,53,6],[50,7,53,7],[50,8,53,8],[47,1,48,1],[47,3,48,3],[47,4,48,4],[47,5,48,5],[47,6,48,6],[47,7,48,7],[42,8,46,8],[43,3,45,3],[35,1,41,1],[35,4,41,4],[35,5,41,5],[35,6,41,6],[35,7,41,7],[35,8,41,8],[37,3,40,3],[42,1,46,1],[42,4,46,4],[42,5,46,5],[42,6,46,6],[42,7,46,7],[32,8,34,8],[23,8,28,8],[24,3,27,3],[29,1,31,1],[29,4,31,4],[29,5,31,5],[29,6,31,6],[29,7,31,7],[29,8,31,8],[23,1,28,1],[23,4,28,4],[23,5,28,5],[23,6,28,6],[23,7,28,7],[32,1,34,1],[32,4,34,4],[32,5,34,5],[32,6,34,6],[32,7,34,7],[9,8,11,8],[14,1,17,1],[14,3,17,3],[14,4,17,4],[14,5,17,5],[14,6,17,6],[14,7,17,7],[14,8,17,8],[18,1,22,1],[18,3,22,3],[18,4,22,4],[0,6,1,6],[0,7,1,7],[2,0,8,0],[2,1,8,1],[2,3,8,3],[2,4,8,4],[9,0,22,0],[9,1,13,1],[9,3,13,3],[9,4,13,4],[0,0,1,1],[0,2,1,2],[0,3,1,3],[0,4,1,4],[9,5,11,5],[9,6,11,6],[9,7,11,7]]}
["Step of the LCA",null,"Verification to do :","§ of PCR and/or document reference","Verified documents","Type of comment","Comment of the Accredited Verifier","Answer of the organization","Conformity"]
[null,null,null,null,null,"(technical / editorial)",null,null,"Y/N"]
["General Information",1,"Conformity of the redaction of the LCA report","§ 3.2","Accompanying report"]
[null,null,"               -   date of report"]
[null,null,"               -   period of validity"]
[null,null,"               -   author of the report"]
[null,null,"               -  Report identification"]
[null,null,"               -   PCR version"]
[null,null,"Precision of manufacturing sites"]
["Scope of the study",2,"Characterization of the Functional Unit done according to the PCR.","§ 2.1 and § 3.3.","Accompanying report","     ","     ","     ","     "]
[null,null,"    - description of the reference flow and its FU"]
[null,null,"    - characterization of the product category"]
[null,null,"    - PCR version PSR, if relevant"]
[null,null,"    - Justification of the FU, if no relevant PSR"]
[null,3,"Characterization of the reference flow","§ 2.1","Accompanying report","     ","     ","     ","     "]
[null,null,"    - Reference Product and its mass (kg)"]
[null,null,"    - Packaging"]
[null,null,"    - Required elements for the installation"]
[null,4,"Description of the reference product","§ 3.3","Accompanying report"]
[null,null,"    - identification of the reference product and its commercial reference"]
{"$rows_left_out":76}
{"sheet":"Table FR","index":10,"n_rows":95,"n_cols":9,"rows_kept":95,"cut":false,"hidden":true,"merged":[[91,0,94,0],[91,1,94,1],[91,3,92,3],[93,3,94,3],[74,0,82,0],[74,1,82,1],[74,4,82,4],[76,3,77,3],[78,3,80,3],[82,3,83,3],[83,0,90,0],[83,1,90,1],[83,4,90,4],[89,3,90,3],[56,1,62,1],[56,3,59,3],[56,4,59,4],[63,0,73,0],[63,1,73,1],[63,4,73,4],[64,3,66,3],[68,3,69,3],[70,3,73,3],[48,1,49,1],[48,3,49,3],[48,4,49,4],[51,1,55,1],[51,3,55,3],[51,4,55,4],[33,1,35,1],[33,4,35,4],[36,1,42,1],[36,4,42,4],[38,3,41,3],[42,3,43,3],[43,1,47,1],[43,4,47,4],[44,3,46,3],[25,3,28,3],[25,4,28,4],[29,3,30,3],[30,1,32,1],[30,4,32,4],[2,0,8,0],[2,1,8,1],[2,3,8,3],[2,4,8,4],[9,0,23,0],[9,1,13,1],[9,3,13,3],[9,4,13,4],[14,1,17,1],[14,3,17,3],[14,4,17,4],[18,1,23,1],[18,3,24,3],[18,4,23,4],[24,0,62,0],[24,1,29,1],[0,7,1,7],[0,0,1,1],[0,2,1,2],[0,3,1,3],[0,4,1,4],[0,6,1,6]]}
["Etape dans l'ACV",null,"Vérifications à effectuer :","§ du PCR et/ou référence document","Documents vérifiés","Type de commentaire","Commentaire du vérificateur habilité","Réponse de l'organisation","Conformité"]
[null,null,null,null,null,"(technique / editorial)",null,null,"O/N"]
["Informations générales",1,"Conformité de la rédaction du rapport d'ACV","§ 3.2"," Rapport d'accompagnement"]
[null,null,"               -   date du rapport"]
[null,null,"               -   période de validité"]
[null,null,"               -   auteur du rapport"]
[null,null,"               -   identification du rapport"]
[null,null,"               -   Version PCR"]
[null,null,"Mention des sites de production"]
["Champ de l'étude",2,"Caractérisation de l’unité fonctionnelle faite selon le document « Règles de rédaction des PEP».","§ 2.1 et § 3.3."," Rapport d'accompagnement","     ","     ","     "]
[null,null,"    - description du flux de référence et son UF"]
[null,null,"    - caractérisation de la catégorie de produit"]
[null,null,"    - Version PSR si applicable"]
[null,null,"    - Justification de l'UF si pas de PSR applicable"]
[null,3,"Caractérisation du flux de référence","§ 2.1"," Rapport d'accompagnement","     ","     ","     "]
[null,null,"    - Produit de référence et sa masse (kg)"]
[null,null,"    - Emballages"]
[null,null,"    - Eléments nécessaires à l’installation"]
[null,4,"Description du produit de référence","§ 3.3"," Rapport d'accompagnement"]
[null,null,"    - identification du produit de référence et référence commerciale"]
{"$rows_left_out":75}